Reaction Details
TargetSolute carrier family 22 member 3
LigandBDBM35229
Substrate/Competitorn/a
Meas. Tech.ChEMBL_838723 (CHEMBL2078549)
Ki 14000±n/a nM
Citation Wu, XHuang, WGanapathy, MEWang, HKekuda, RConway, SJLeibach, FHGanapathy, V Structure, function, and regional distribution of the organic cation transporter OCT3 in the kidney. Am J Physiol Renal Physiol279:449-58 (2000) 
 
Solute carrier family 22 member 3
Name:Solute carrier family 22 member 3
Type:PROTEIN
Mol. Mass.:61292.57
Organism:Homo sapiens (Human)
Description:ChEMBL_934315
Residue:556
BDBM35229
NameBDBM35229
Synonyms:3-(10,11-dihydro-5H-dibenzo[b,f]azepin-5-yl)-N-methylpropan-1-amine CHEMBL72 DMI Desipramine N-(3-methylaminopropyl)iminobibenzyl demethylimipramine norimipramine
TypeSmall organic molecule
Emp. Form.C18H22N2
Mol. Mass.266.3807
SMILESCNCCCN1c2ccccc2CCc2ccccc12