Reaction Details
TargetSolute carrier family 22 member 3
LigandBDBM50225285
Substrate/Competitorn/a
Meas. Tech.ChEMBL_838723 (CHEMBL2078549)
Ki 373000±n/a nM
Citation Wu, XHuang, WGanapathy, MEWang, HKekuda, RConway, SJLeibach, FHGanapathy, V Structure, function, and regional distribution of the organic cation transporter OCT3 in the kidney. Am J Physiol Renal Physiol279:449-58 (2000) 
 
Solute carrier family 22 member 3
Name:Solute carrier family 22 member 3
Type:PROTEIN
Mol. Mass.:61292.57
Organism:Homo sapiens (Human)
Description:ChEMBL_934315
Residue:556
BDBM50225285
NameBDBM50225285
Synonyms:CHEBI:3757 Catapres-Tts-1 Catapres-Tts-3 Clorpres Duraclon ST-155BS
TypeSmall organic molecule
Emp. Form.C9H9Cl2N3
Mol. Mass.230.094
SMILESClc1cccc(Cl)c1NC1=NCCN1