Reaction Details
TargetSolute carrier family 22 member 5
LigandBDBM50485614
Substrate/Competitorn/a
Meas. Tech.ChEMBL_836620 (CHEMBL2077361)
IC50 64000000±n/a nM
Citation Ganapathy, MEHuang, WRajan, DPCarter, ALSugawara, MIseki, KLeibach, FHGanapathy, V beta-lactam antibiotics as substrates for OCTN2, an organic cation/carnitine transporter. J Biol Chem275:1699-707 (2000) 
 
Solute carrier family 22 member 5
Name:Solute carrier family 22 member 5
Type:PROTEIN
Mol. Mass.:62756.52
Organism:Homo sapiens
Description:ChEMBL_104634
Residue:557
BDBM50485614
NameBDBM50485614
Synonyms:Cefoselis
TypeSmall organic molecule
Emp. Form.C19H22N8O6S2
Mol. Mass.522.558
SMILES[H][C@@]1(NC(=O)C(=N/OC)\c2csc(N)n2)C(=O)N2C(C([O-])=O)=C(C[n+]3ccc(N)n3CCO)CS[C@]12[H]