Reaction Details
TargetSolute carrier family 22 member 5
LigandBDBM50350470
Substrate/Competitorn/a
Meas. Tech.ChEMBL_836620 (CHEMBL2077361)
IC50 1700000±n/a nM
Citation Ganapathy, MEHuang, WRajan, DPCarter, ALSugawara, MIseki, KLeibach, FHGanapathy, V beta-lactam antibiotics as substrates for OCTN2, an organic cation/carnitine transporter. J Biol Chem275:1699-707 (2000) 
 
Solute carrier family 22 member 5
Name:Solute carrier family 22 member 5
Type:PROTEIN
Mol. Mass.:62756.52
Organism:Homo sapiens
Description:ChEMBL_104634
Residue:557
BDBM50350470
NameBDBM50350470
Synonyms:CEFEPIME | Maxipime
TypeSmall organic molecule
Emp. Form.C19H24N6O5S2
Mol. Mass.480.561
SMILESCO\N=C(/C(=O)N[C@H]1[C@H]2SCC(C[N+]3(C)CCCC3)=C(N2C1=O)C([O-])=O)c1csc(N)n1