Reaction Details
TargetGenome polyprotein
LigandBDBM50485813
Substrate/Competitorn/a
Meas. Tech.ChEMBL_858568 (CHEMBL2166013)
IC50 650±n/a nM
Citation Kim, BKKim, JHKim, NRLee, WGLee, SDYun, SHJeon, ESKim, YC Development of anti-coxsackievirus agents targeting 3C protease. Bioorg Med Chem Lett22:6952-6 (2012) 
 
Genome polyprotein
Name:Genome polyprotein
Type:Enzyme
Mol. Mass.:243464.96
Organism:Coxsackievirus B3 (strain Nancy)
Description:P03313
Residue:2185
BDBM50485813
NameBDBM50485813
Synonyms:CHEMBL2164930
TypeSmall organic molecule
Emp. Form.C34H37FN8O8
Mol. Mass.704.7048
SMILESCC(C)[C@H](NC(=O)c1cc(C)on1)C(=O)N[C@@H](Cc1ccc(F)cc1)C(=O)N[C@H](CCC(N)=O)\C=C\C(=O)OCc1nc(no1)-c1ccncc1