Reaction Details
TargetEndothelin-1 receptor
LigandBDBM50407601
Substrate/Competitorn/a
Meas. Tech.ChEMBL_65814 (CHEMBL679716)
IC50 29±n/a nM
Citation Fukami, TNagase, TFujita, KHayama, TNiiyama, KMase, TNakajima, SFukuroda, TSaeki, TNishikibe, M Structure-activity relationships of cyclic pentapeptide endothelin A receptor antagonists. J Med Chem38:4309-24 (1995) Endothelin-1 receptor
Name:Endothelin-1 receptor
Type:PROTEIN
Mol. Mass.:48707.29
Organism:Sus scrofa
Description:ChEMBL_65803
Residue:427
BDBM50407601
NameBDBM50407601
Synonyms:CHEMBL137716
TypeSmall organic molecule
Emp. Form.C33H44N6O9
Mol. Mass.668.7373
SMILESCOC(=O)n1cc(C[C@@H]2NC(=O)[C@@H](CC(C)C)NC(=O)[C@@H](NC(=O)[C@H]3CCCN3C(=O)[C@H](CC(O)=O)NC2=O)C(C)C)c2ccccc12