Reaction Details
TargetSerine protease 1
LigandBDBM50029499
Substrate/Competitorn/a
Meas. Tech.ChEMBL_212346 (CHEMBL816793)
IC50 8.8±n/a nM
Citation Shuman, RTRothenberger, RBCampbell, CSSmith, GFGifford-Moore, DSPaschal, JWGesellchen, PD Structure-activity study of tripeptide thrombin inhibitors using alpha-alkyl amino acids and other conformationally constrained amino acid substitutions. J Med Chem38:4446-53 (1995) Serine protease 1
Name:Serine protease 1
Type:Enzyme
Mol. Mass.:25790.52
Organism:Bos taurus (bovine)
Description:P00760
Residue:246
BDBM50029499
NameBDBM50029499
Synonyms:CHEMBL141834 | tert-butyloxy carbonyl-D-Phe-thiazolidine-4-carboxylate-Arg-H
TypeSmall organic molecule
Emp. Form.C24H36N6O5S
Mol. Mass.520.645
SMILESCC(C)(C)OC(=O)N[C@@H](Cc1ccccc1)C(=O)N1CSCC1C(=O)N[C@@H](CCCNC(N)=N)C=O