Reaction Details
TargetCoagulation factor X
LigandBDBM50029501
Substrate/Competitorn/a
Meas. Tech.ChEMBL_48475 (CHEMBL663037)
IC50 550±n/a nM
Citation Shuman, RTRothenberger, RBCampbell, CSSmith, GFGifford-Moore, DSPaschal, JWGesellchen, PD Structure-activity study of tripeptide thrombin inhibitors using alpha-alkyl amino acids and other conformationally constrained amino acid substitutions. J Med Chem38:4446-53 (1995) Coagulation factor X
Name:Coagulation factor X
Type:PROTEIN
Mol. Mass.:54498.45
Organism:Bos taurus
Description:ChEMBL_1364435
Residue:492
BDBM50029501
NameBDBM50029501
Synonyms:5N-[4-amino(imino)methylamino-1-formyl-(1S)-butyl]-1-[(1R,4aS,8aS)-perhydro-1-isoquinolinylcarbonyl]-(5S)-dihydro-1H-5-pyrrolecarboxamide | CHEMBL136647
TypeSmall organic molecule
Emp. Form.C21H36N6O3
Mol. Mass.420.5489
SMILESNC(=N)NCCC[C@H](NC(=O)[C@@H]1CCCN1C(=O)[C@@H]1NCC[C@@H]2CCCC[C@H]12)C=O