Reaction Details
TargetSerine protease 1
LigandBDBM50029508
Substrate/Competitorn/a
Meas. Tech.ChEMBL_212346 (CHEMBL816793)
IC50 62000±n/a nM
Citation Shuman, RTRothenberger, RBCampbell, CSSmith, GFGifford-Moore, DSPaschal, JWGesellchen, PD Structure-activity study of tripeptide thrombin inhibitors using alpha-alkyl amino acids and other conformationally constrained amino acid substitutions. J Med Chem38:4446-53 (1995) Serine protease 1
Name:Serine protease 1
Type:Enzyme
Mol. Mass.:25790.52
Organism:Bos taurus (bovine)
Description:P00760
Residue:246
BDBM50029508
NameBDBM50029508
Synonyms:1N-[1-{2-[4-amino(imino)methylamino-1-formyl-(1S)-butylcarbamoyl]-1-azetanylcarbonyl}-1-phenyl-(1R)-propyl]-2,2,2-trifluoroacetamide | CHEMBL2370863
TypeSmall organic molecule
Emp. Form.C22H29F3N6O4
Mol. Mass.498.4987
SMILES[#6]-[#6][C@]([#7]-[#6](=O)C(F)(F)F)([#6](=O)-[#7]-1-[#6]-[#6]-[#6@H]-1-[#6](=O)-[#7]-[#6@@H](-[#6]-[#6]-[#6]\[#7]=[#6](\[#7])-[#7])-[#6]=O)c1ccccc1