Reaction Details
TargetProthrombin
LigandBDBM50029506
Substrate/Competitorn/a
Meas. Tech.ChEMBL_210582 (CHEMBL816532)
IC50 16±n/a nM
Citation Shuman, RTRothenberger, RBCampbell, CSSmith, GFGifford-Moore, DSPaschal, JWGesellchen, PD Structure-activity study of tripeptide thrombin inhibitors using alpha-alkyl amino acids and other conformationally constrained amino acid substitutions. J Med Chem38:4446-53 (1995) Prothrombin
Name:Prothrombin
Type:Enzyme
Mol. Mass.:70502.73
Organism:Bos taurus (Bovine)
Description:P00735
Residue:625
BDBM50029506
NameBDBM50029506
Synonyms:CHEMBL318998 {(R)-2-[(S)-2-((S)-1-Formyl-4-guanidino-butylcarbamoyl)-pyrrolidin-1-yl]-2-oxo-1-phenyl-ethyl}-carbamic acid tert-butyl ester
TypeSmall organic molecule
Emp. Form.C24H36N6O5
Mol. Mass.488.5798
SMILESCC(C)(C)OC(=O)N[C@@H](C(=O)N1CCC[C@H]1C(=O)N[C@@H](CCCNC(N)=N)C=O)c1ccccc1