Reaction Details
TargetCoagulation factor X
LigandBDBM50029515
Substrate/Competitorn/a
Meas. Tech.ChEMBL_48475 (CHEMBL663037)
IC50 1300±n/a nM
Citation Shuman, RTRothenberger, RBCampbell, CSSmith, GFGifford-Moore, DSPaschal, JWGesellchen, PD Structure-activity study of tripeptide thrombin inhibitors using alpha-alkyl amino acids and other conformationally constrained amino acid substitutions. J Med Chem38:4446-53 (1995) Coagulation factor X
Name:Coagulation factor X
Type:PROTEIN
Mol. Mass.:54498.45
Organism:Bos taurus
Description:ChEMBL_1364435
Residue:492
BDBM50029515
NameBDBM50029515
Synonyms:CHEMBL141584 | tert-butyloxy carbonyl-D-Phe-azetidine-2-carboxylate-Arg-H
TypeSmall organic molecule
Emp. Form.C24H36N6O6
Mol. Mass.504.5792
SMILESCC(C)(C)OC(=O)N[C@@H](Cc1ccccc1)C(=O)N1CC[C@H]1C(=O)N[C@@H](CCCNC(N)=N)C(O)=O