Reaction Details
TargetSerine protease 1
LigandBDBM50029510
Substrate/Competitorn/a
Meas. Tech.ChEMBL_212346 (CHEMBL816793)
IC50 11±n/a nM
Citation Shuman, RTRothenberger, RBCampbell, CSSmith, GFGifford-Moore, DSPaschal, JWGesellchen, PD Structure-activity study of tripeptide thrombin inhibitors using alpha-alkyl amino acids and other conformationally constrained amino acid substitutions. J Med Chem38:4446-53 (1995) Serine protease 1
Name:Serine protease 1
Type:Enzyme
Mol. Mass.:25790.52
Organism:Bos taurus (bovine)
Description:P00760
Residue:246
BDBM50029510
NameBDBM50029510
Synonyms:1N-[2-{2-[4-amino(imino)methylamino-1-formyl-(1S)-butylcarbamoyl]-1-azetanyl}-1-methyl-2-oxo-1-phenyl-(1R)-ethyl]-benzyloxy carbamide | CHEMBL342611
TypeSmall organic molecule
Emp. Form.C23H34N6O5
Mol. Mass.474.5533
SMILESCC(C)(C)OC(=O)N[C@@H](C(=O)N1CC[C@H]1C(=O)N[C@@H](CCCNC(N)=N)C=O)c1ccccc1