Reaction Details
TargetProthrombin
LigandBDBM50029515
Substrate/Competitorn/a
Meas. Tech.ChEMBL_210582 (CHEMBL816532)
IC50 18±n/a nM
Citation Shuman, RTRothenberger, RBCampbell, CSSmith, GFGifford-Moore, DSPaschal, JWGesellchen, PD Structure-activity study of tripeptide thrombin inhibitors using alpha-alkyl amino acids and other conformationally constrained amino acid substitutions. J Med Chem38:4446-53 (1995) Prothrombin
Name:Prothrombin
Type:Enzyme
Mol. Mass.:70502.73
Organism:Bos taurus (Bovine)
Description:P00735
Residue:625
BDBM50029515
NameBDBM50029515
Synonyms:CHEMBL141584 | tert-butyloxy carbonyl-D-Phe-azetidine-2-carboxylate-Arg-H
TypeSmall organic molecule
Emp. Form.C24H36N6O6
Mol. Mass.504.5792
SMILESCC(C)(C)OC(=O)N[C@@H](Cc1ccccc1)C(=O)N1CC[C@H]1C(=O)N[C@@H](CCCNC(N)=N)C(O)=O