Reaction Details
TargetProthrombin
LigandBDBM50029502
Substrate/Competitorn/a
Meas. Tech.ChEMBL_210582 (CHEMBL816532)
IC50 64±n/a nM
Citation Shuman, RTRothenberger, RBCampbell, CSSmith, GFGifford-Moore, DSPaschal, JWGesellchen, PD Structure-activity study of tripeptide thrombin inhibitors using alpha-alkyl amino acids and other conformationally constrained amino acid substitutions. J Med Chem38:4446-53 (1995) Prothrombin
Name:Prothrombin
Type:Enzyme
Mol. Mass.:70502.73
Organism:Bos taurus (Bovine)
Description:P00735
Residue:625
BDBM50029502
NameBDBM50029502
Synonyms:1N-[2-[5-[4-amino(imino)methylamino-1-formyl-(1S)-butylcarbamoyl]-(5S)-dihydro-1H-1-pyrrolyl]-1-methyl-2-oxo-1-phenyl-(1R)-ethyl]-2,2,2-trifluoroacetamide | CHEMBL138568
TypeSmall organic molecule
Emp. Form.C22H29F3N6O4
Mol. Mass.498.4987
SMILESC[C@](NC(=O)C(F)(F)F)(C(=O)N1CCC[C@H]1C(=O)N[C@@H](CCCNC(N)=N)C=O)c1ccccc1