Reaction Details
TargetCoagulation factor X
LigandBDBM50029513
Substrate/Competitorn/a
Meas. Tech.ChEMBL_48475 (CHEMBL663037)
IC50 3300±n/a nM
Citation Shuman, RTRothenberger, RBCampbell, CSSmith, GFGifford-Moore, DSPaschal, JWGesellchen, PD Structure-activity study of tripeptide thrombin inhibitors using alpha-alkyl amino acids and other conformationally constrained amino acid substitutions. J Med Chem38:4446-53 (1995) Coagulation factor X
Name:Coagulation factor X
Type:PROTEIN
Mol. Mass.:54498.45
Organism:Bos taurus
Description:ChEMBL_1364435
Residue:492
BDBM50029513
NameBDBM50029513
Synonyms:(S)-1-((4aS,8aS)-Decahydro-isoquinoline-3-carbonyl)-pyrrolidine-2-carboxylic acid ((S)-1-formyl-4-guanidino-butyl)-amide | CHEMBL2370865
TypeSmall organic molecule
Emp. Form.C21H36N6O3
Mol. Mass.420.5489
SMILES[H][C@]12CCCC[C@@]1([H])C[C@H](NC2)C(=O)N1CCC[C@H]1C(=O)N[C@@H](CCCNC(N)=N)C=O