Reaction Details
TargetSubstance-P receptor
LigandBDBM50029871
Substrate/Competitorn/a
Meas. Tech.ChEMBL_205712 (CHEMBL807959)
IC50 0.900±n/a nM
Citation Swain, CJSeward, EMCascieri, MAFong, TMHerbert, RMacIntyre, DEMerchant, KJOwen, SNOwens, APSabin, V Identification of a series of 3-(benzyloxy)-1-azabicyclo[2.2.2]octane human NK1 antagonists. J Med Chem38:4793-805 (1996) Substance-P receptor
Name:Substance-P receptor
Type:G Protein-Coupled Receptor (GPCR)
Mol. Mass.:46254.43
Organism:Homo sapiens (Human)
Description:P25103
Residue:407
BDBM50029871
NameBDBM50029871
Synonyms:2-Benzhydryl-3-(3,5-dimethyl-benzyloxy)-1-aza-bicyclo[2.2.2]octane | CHEMBL357012
TypeSmall organic molecule
Emp. Form.C29H33NO
Mol. Mass.411.5784
SMILESCc1cc(C)cc(COC2C3CCN(CC3)C2C(c2ccccc2)c2ccccc2)c1