Reaction Details
TargetReverse transcriptase/RNaseH
LigandBDBM1530
Substrate/Competitorn/a
Meas. Tech.ChEMBL_195068 (CHEMBL797523)
IC50 90±n/a nM
Citation Proudfoot, JRPatel, URKapadia, SRHargrave, KD Novel non-nucleoside inhibitors of HIV-1 reverse transcriptase. 3. Dipyrido[2,3-b:2',3'-e]diazepinones. J Med Chem38:1406-10 (1995) Reverse transcriptase/RNaseH
Name:Reverse transcriptase/RNaseH
Type:PROTEIN
Mol. Mass.:65229.15
Organism:Human immunodeficiency virus 1
Description:ChEMBL_1473730
Residue:566
BDBM1530
NameBDBM1530
Synonyms:5-chloro-2-cyclopropyl-9-methyl-2,4,9,15-tetraazatricyclo[9.4.0.0^{3,8}]pentadeca-1(11),3,5,7,12,14-hexaen-10-one | Dipyridodiazepinone deriv. 17
TypeSmall organic molecule
Emp. Form.C15H13ClN4O
Mol. Mass.300.743
SMILESCN1c2ccc(Cl)nc2N(C2CC2)c2ncccc2C1=O