Reaction Details
TargetReverse transcriptase/RNaseH
LigandBDBM50030546
Substrate/Competitorn/a
Meas. Tech.ChEMBL_195358 (CHEMBL802598)
IC50>100000±n/a nM
Citation Maruenda, HJohnson, F Design and synthesis of novel inhibitors of HIV-1 reverse transcriptase. J Med Chem38:2145-51 (1995) Reverse transcriptase/RNaseH
Name:Reverse transcriptase/RNaseH
Type:PROTEIN
Mol. Mass.:65229.15
Organism:Human immunodeficiency virus 1
Description:ChEMBL_1473730
Residue:566
BDBM50030546
NameBDBM50030546
Synonyms:Acetic acid 2-(2-methyl-1,3-dioxo-2,3,10,11-tetrahydro-1H-5-thia-2,4,10-triaza-dibenzo[a,d]cyclohepten-4-ylmethoxy)-ethyl ester | CHEMBL69275
TypeSmall organic molecule
Emp. Form.C17H19N3O5S
Mol. Mass.377.415
SMILESCC(=O)OCCOCn1c2Sc3ccccc3NCc2c(=O)n(C)c1=O