Reaction Details
TargetReverse transcriptase/RNaseH
LigandBDBM50030553
Substrate/Competitorn/a
Meas. Tech.ChEMBL_195358 (CHEMBL802598)
IC50>100000±n/a nM
Citation Maruenda, HJohnson, F Design and synthesis of novel inhibitors of HIV-1 reverse transcriptase. J Med Chem38:2145-51 (1995) Reverse transcriptase/RNaseH
Name:Reverse transcriptase/RNaseH
Type:PROTEIN
Mol. Mass.:65229.15
Organism:Human immunodeficiency virus 1
Description:ChEMBL_1473730
Residue:566
BDBM50030553
NameBDBM50030553
Synonyms:4-(2-Hydroxy-ethoxymethyl)-10,11-dihydro-4H-5-thia-2,4,10-triaza-dibenzo[a,d]cycloheptene-1,3-dione | CHEMBL69934
TypeSmall organic molecule
Emp. Form.C14H15N3O4S
Mol. Mass.321.352
SMILESOCCOCn1c2Sc3ccccc3NCc2c(=O)[nH]c1=O