Reaction Details
TargetType-1 angiotensin II receptor
LigandBDBM50030684
Substrate/Competitorn/a
Meas. Tech.ChEMBL_36952 (CHEMBL648855)
IC50 0.100000±n/a nM
Citation Chang, LLAshton, WTFlanagan, KLChen, TBO'Malley, SSZingaro, GJKivlighn, SDSiegl, PKLotti, VJChang, RS Potent and orally active angiotensin II receptor antagonists with equal affinity for human AT1 and AT2 subtypes. J Med Chem38:3741-58 (1995) Type-1 angiotensin II receptor
Name:Type-1 angiotensin II receptor
Type:Enzyme Catalytic Domain
Mol. Mass.:41009.15
Organism:RABBIT
Description:ANGIOTENSIN AT1 AGTR1 RABBIT::P34976
Residue:359
BDBM50030684
NameBDBM50030684
Synonyms:CHEMBL339722 | N-{3-[3-Butyl-4-(3-fluoro-2-(N-t-butyloxycarbonyl)-Sulfanamido-l-biphenyl-4-ylmethyl)-5-oxo-4,5-dihydro-[1,2,4]triazol-1-yl]-4-chloro-phenyl}-2-ethoxy-acetamide
TypeSmall organic molecule
Emp. Form.C34H39ClFN5O7S
Mol. Mass.716.219
SMILESCCCCc1nn(-c2cc(NC(=O)COCC)ccc2Cl)c(=O)n1Cc1ccc(cc1F)-c1ccccc1S(=O)(=O)NC(=O)OC(C)(C)C