Reaction Details
TargetType-2 angiotensin II receptor
LigandBDBM50030721
Substrate/Competitorn/a
Meas. Tech.ChEMBL_35412 (CHEMBL643586)
IC50 0.092±n/a nM
Citation Chang, LLAshton, WTFlanagan, KLChen, TBO'Malley, SSZingaro, GJKivlighn, SDSiegl, PKLotti, VJChang, RS Potent and orally active angiotensin II receptor antagonists with equal affinity for human AT1 and AT2 subtypes. J Med Chem38:3741-58 (1995) Type-2 angiotensin II receptor
Name:Type-2 angiotensin II receptor
Type:Enzyme Catalytic Domain
Mol. Mass.:41346.62
Organism:RAT
Description:Angiotensin II AT2 0 0::P35351
Residue:363
BDBM50030721
NameBDBM50030721
Synonyms:4-Bromo-N-butyl-3-{4-[2'-(2,5-dichloro-benzoylsulfamoyl)-3-fluoro-biphenyl-4-ylmethyl]-5-oxo-3-propyl-4,5-dihydro-[1,2,4]triazol-1-yl}-benzamide | CHEMBL122401
TypeSmall organic molecule
Emp. Form.C36H33BrCl2FN5O5S
Mol. Mass.817.551
SMILESCCCCNC(=O)c1ccc(Br)c(c1)-n1nc(CCC)n(Cc2ccc(cc2F)-c2ccccc2S(=O)(=O)NC(=O)c2cc(Cl)ccc2Cl)c1=O