Reaction Details
TargetType-2 angiotensin II receptor
LigandBDBM50030729
Substrate/Competitorn/a
Meas. Tech.ChEMBL_35413 (CHEMBL643587)
IC50 0.39±n/a nM
Citation Chang, LLAshton, WTFlanagan, KLChen, TBO'Malley, SSZingaro, GJKivlighn, SDSiegl, PKLotti, VJChang, RS Potent and orally active angiotensin II receptor antagonists with equal affinity for human AT1 and AT2 subtypes. J Med Chem38:3741-58 (1995) Type-2 angiotensin II receptor
Name:Type-2 angiotensin II receptor
Type:Enzyme Catalytic Domain
Mol. Mass.:41346.62
Organism:RAT
Description:Angiotensin II AT2 0 0::P35351
Residue:363
BDBM50030729
NameBDBM50030729
Synonyms:CHEMBL124771 | N-{4-Bromo-3-[3-butyl-4-(3-fluoro-2-(N-t-butyloxycarbonyl)-Sulfanamido-biphenyl-4-ylmethyl)-5-oxo-4,5-dihydro-[1,2,4]triazol-1-yl]-phenyl}-propionamide
TypeSmall organic molecule
Emp. Form.C33H37BrFN5O6S
Mol. Mass.730.644
SMILESCCCCc1nn(-c2cc(NC(=O)CC)ccc2Br)c(=O)n1Cc1ccc(cc1F)-c1ccccc1S(=O)(=O)NC(=O)OC(C)(C)C