Reaction Details
TargetNeutrophil elastase
LigandBDBM50031196
Substrate/Competitorn/a
Meas. Tech.ChEMBL_63969 (CHEMBL677437)
Ki 0.06±n/a nM
Citation Edwards, PDZottola, MADavis, MWilliams, JTuthill, PA Peptidyl alpha-ketoheterocyclic inhibitors of human neutrophil elastase. 3. In vitro and in vivo potency of a series of peptidyl alpha-ketobenzoxazoles. J Med Chem38:3972-82 (1995) Neutrophil elastase
Name:Neutrophil elastase
Type:Enzyme
Mol. Mass.:28532.38
Organism:Homo sapiens (Human)
Description:P08246
Residue:267
BDBM50031196
NameBDBM50031196
Synonyms:2-[3-Methyl-2-({1-[3-methyl-2-(4-chlorophenyl-sulfonylamino-benzoylamino)-butyryl]-pyrrolidine-2-carbonyl}-amino)-butyryl]-benzooxazole-5-carboxylic acid methyl ester. 3.7H2O.0.7H2O.0.7ACOH | CHEMBL339307
TypeSmall organic molecule
Emp. Form.C38H41ClN6O10S
Mol. Mass.809.284
SMILESCOC(=O)c1ccc2oc(nc2c1)C(=O)[C@@H](NC(=O)[C@@H]1CCCN1C(=O)[C@@H](NC(=O)c1ccc(NC(=O)NS(=O)(=O)c2ccc(Cl)cc2)cc1)C(C)C)C(C)C