Reaction Details
TargetNeutrophil elastase
LigandBDBM50031209
Substrate/Competitorn/a
Meas. Tech.ChEMBL_63969 (CHEMBL677437)
Ki 0.33±n/a nM
Citation Edwards, PDZottola, MADavis, MWilliams, JTuthill, PA Peptidyl alpha-ketoheterocyclic inhibitors of human neutrophil elastase. 3. In vitro and in vivo potency of a series of peptidyl alpha-ketobenzoxazoles. J Med Chem38:3972-82 (1995) Neutrophil elastase
Name:Neutrophil elastase
Type:Enzyme
Mol. Mass.:28532.38
Organism:Homo sapiens (Human)
Description:P08246
Residue:267
BDBM50031209
NameBDBM50031209
Synonyms:(S)-1-{(S)-2-[4-(4-Chloro-benzenesulfonylaminocarbonyl)-benzoylamino]-3-methyl-butyryl}-pyrrolidine-2-carboxylic acid [(S)-1-(benzooxazole-2-carbonyl)-2-methyl-propyl]-amide N1-((S)-1-((S)-2-(((S)-1-(benzo[d]oxazol-2-yl)-3-methyl-1-oxobutan-2-yl)carbamoyl)pyrrolidin-1-yl)-3-methyl-1-oxobutan-2-yl)-N4-(4-chlorophenylsulfonyl)terephthalamide
TypeSmall organic molecule
Emp. Form.C36H38ClN5O8S
Mol. Mass.736.234
SMILESCC(C)[C@H](NC(=O)c1ccc(cc1)C(=O)NS(=O)(=O)c1ccc(Cl)cc1)C(=O)N1CCC[C@H]1C(=O)N[C@@H](C(C)C)C(=O)c1nc2ccccc2o1