Reaction Details
TargetDelta-type opioid receptor
LigandBDBM50031219
Substrate/Competitorn/a
Meas. Tech.ChEMBL_147032 (CHEMBL753673)
Ki 856±n/a nM
Citation Sasaki, YChiba, T Novel deltorphin heptapeptide analogs with potent delta agonist, delta antagonist, or mixed mu antagonist/delta agonist properties. J Med Chem38:3995-9 (1995) Delta-type opioid receptor
Name:Delta-type opioid receptor
Type:G Protein-Coupled Receptor (GPCR)
Mol. Mass.:40465.04
Organism:Rattus norvegicus (rat)
Description:Competition binding assays were using CHO-K1 cell membranes expressing the opioid receptor.
Residue:372
BDBM50031219
NameBDBM50031219
Synonyms:(S)-3-[2-({(S)-2-[(S)-2-((S)-2-{(R)-2-[(S)-2-Amino-3-(4-hydroxy-phenyl)-propionylamino]-4-methylsulfanyl-butyrylamino}-3-phenyl-propionylamino)-3-(3H-imidazol-4-yl)-propionylamino]-4-methyl-pentanoyl}-sec-butyl-amino)-acetylamino]-succinamic acid | CHEMBL2370671
TypeSmall organic molecule
Emp. Form.C45H64N10O10S
Mol. Mass.937.116
SMILESCC[C@H](C)N(CC(=O)N[C@@H](CC(O)=O)C(N)=O)C(=O)[C@H](CC(C)C)NC(=O)[C@H](Cc1c[nH]cn1)NC(=O)[C@H](Cc1ccccc1)NC(=O)[C@@H](CCSC)NC(=O)[C@@H](N)Cc1ccc(O)cc1