Reaction Details
TargetReverse transcriptase/RNaseH
LigandBDBM50407561
Substrate/Competitorn/a
Meas. Tech.ChEMBL_195844 (CHEMBL799143)
IC50>100000±n/a nM
Citation Krawczyk, SHNassiri, MRKucera, LSKern, ERPtak, RGWotring, LLDrach, JCTownsend, LB Synthesis and antiproliferative and antiviral activity of 2'-deoxy-2'-fluoroarabinofuranosyl analogs of the nucleoside antibiotics toyocamycin and sangivamycin. J Med Chem38:4106-14 (1995) Reverse transcriptase/RNaseH
Name:Reverse transcriptase/RNaseH
Type:PROTEIN
Mol. Mass.:65229.15
Organism:Human immunodeficiency virus 1
Description:ChEMBL_1473730
Residue:566
BDBM50407561
NameBDBM50407561
Synonyms:CHEMBL2112691
TypeSmall organic molecule
Emp. Form.C12H12FN5O3
Mol. Mass.293.2538
SMILESNc1ncnc2n(cc(C#N)c12)[C@H]1O[C@H](CO)[C@@H](O)[C@@H]1F