Reaction Details
TargetProthrombin
LigandBDBM50031708
Substrate/Competitorn/a
Meas. Tech.ChEMBL_209070 (CHEMBL809536)
IC50 3660±n/a nM
Citation Senokuchi, KNakai, HNakayama, YOdagaki, YSakaki, KKato, MMaruyama, TMiyazaki, TIto, HKamiyasu, K New orally active serine protease inhibitors. J Med Chem38:2521-3 (1995) Prothrombin
Name:Prothrombin
Type:Protein
Mol. Mass.:70029.57
Organism:Homo sapiens (Human)
Description:P00734
Residue:622
BDBM50031708
NameBDBM50031708
Synonyms:4-[(E)-2-(Allyl-ethoxycarbonylmethyl-carbamoyl)-propenyl]-benzoic acid 4-carbamimidoyl-phenyl ester; compound with methanesulfonic acid | CHEMBL85136
TypeSmall organic molecule
Emp. Form.C25H27N3O5
Mol. Mass.449.499
SMILESCCOC(=O)CN(CC=C)C(=O)C(\C)=C\c1ccc(cc1)C(=O)Oc1ccc(cc1)C(N)=N