Reaction Details
TargetInterstitial collagenase
LigandBDBM50031772
Substrate/Competitorn/a
Meas. Tech.ChEMBL_49513 (CHEMBL663463)
Ki 5100±n/a nM
Citation Gowravaram, MRTomczuk, BEJohnson, JSDelecki, DCook, ERGhose, AKMathiowetz, AMSpurlino, JCRubin, BSmith, DL Inhibition of matrix metalloproteinases by hydroxamates containing heteroatom-based modifications of the P1' group. J Med Chem38:2570-81 (1995) Interstitial collagenase
Name:Interstitial collagenase
Type:Enzyme
Mol. Mass.:54010.26
Organism:Homo sapiens (Human)
Description: P03956
Residue:469
BDBM50031772
NameBDBM50031772
Synonyms:(R)-3-((S)-1-Methylcarbamoyl-2-phenyl-ethylcarbamoyl)-heptanedioic acid 1-hydroxyamide 7-propylamide CHEMBL85766
TypeSmall organic molecule
Emp. Form.C21H32N4O5
Mol. Mass.420.5026
SMILESCCCNC(=O)CCC[C@H](CC(=O)NO)C(=O)N[C@@H](Cc1ccccc1)C(=O)NC