Reaction Details
TargetStromelysin-1
LigandBDBM50031773
Substrate/Competitorn/a
Meas. Tech.ChEMBL_205626 (CHEMBL812385)
Ki 9.0±n/a nM
Citation Gowravaram, MRTomczuk, BEJohnson, JSDelecki, DCook, ERGhose, AKMathiowetz, AMSpurlino, JCRubin, BSmith, DL Inhibition of matrix metalloproteinases by hydroxamates containing heteroatom-based modifications of the P1' group. J Med Chem38:2570-81 (1995) Stromelysin-1
Name:Stromelysin-1
Type:Enzyme
Mol. Mass.:53973.13
Organism:Homo sapiens (Human)
Description: P08254
Residue:477
BDBM50031773
NameBDBM50031773
Synonyms:(R)-2-[4-(4-Chloro-phenoxy)-butyl]-N*1*-((S)-2,2-dimethyl-1-methylcarbamoyl-propyl)-N*4*-hydroxy-succinamide | CHEMBL421161
TypeSmall organic molecule
Emp. Form.C21H32ClN3O5
Mol. Mass.441.949
SMILESCNC(=O)[C@@H](NC(=O)[C@H](CCCCOc1ccc(Cl)cc1)CC(=O)NO)C(C)(C)C