Reaction Details
TargetNeutrophil collagenase
LigandBDBM50031779
Substrate/Competitorn/a
Meas. Tech.ChEMBL_49517 (CHEMBL660241)
Ki 12±n/a nM
Citation Gowravaram, MRTomczuk, BEJohnson, JSDelecki, DCook, ERGhose, AKMathiowetz, AMSpurlino, JCRubin, BSmith, DL Inhibition of matrix metalloproteinases by hydroxamates containing heteroatom-based modifications of the P1' group. J Med Chem38:2570-81 (1995) Neutrophil collagenase
Name:Neutrophil collagenase
Type:Enzyme
Mol. Mass.:53413.48
Organism:Homo sapiens (Human)
Description:P22894
Residue:467
BDBM50031779
NameBDBM50031779
Synonyms:(R)-2-(4-Butyrylamino-butyl)-N*4*-hydroxy-N*1*-((S)-1-methylcarbamoyl-2-phenyl-ethyl)-succinamide CHEMBL313356
TypeSmall organic molecule
Emp. Form.C22H34N4O5
Mol. Mass.434.5292
SMILESCCCC(=O)NCCCC[C@H](CC(=O)NO)C(=O)N[C@@H](Cc1ccccc1)C(=O)NC