Reaction Details
TargetInterstitial collagenase
LigandBDBM50031776
Substrate/Competitorn/a
Meas. Tech.ChEMBL_49513 (CHEMBL663463)
Ki 11±n/a nM
Citation Gowravaram, MRTomczuk, BEJohnson, JSDelecki, DCook, ERGhose, AKMathiowetz, AMSpurlino, JCRubin, BSmith, DL Inhibition of matrix metalloproteinases by hydroxamates containing heteroatom-based modifications of the P1' group. J Med Chem38:2570-81 (1995) Interstitial collagenase
Name:Interstitial collagenase
Type:Enzyme
Mol. Mass.:54010.26
Organism:Homo sapiens (Human)
Description: P03956
Residue:469
BDBM50031776
NameBDBM50031776
Synonyms:(R)-N*1*-((S)-2,2-Dimethyl-1-methylcarbamoyl-propyl)-2-[4-(4-fluoro-phenoxy)-butyl]-N*4*-hydroxy-succinamide | CHEMBL406131
TypeSmall organic molecule
Emp. Form.C21H32FN3O5
Mol. Mass.425.4943
SMILESCNC(=O)[C@@H](NC(=O)[C@H](CCCCOc1ccc(F)cc1)CC(=O)NO)C(C)(C)C