Reaction Details
TargetStromelysin-1
LigandBDBM50031789
Substrate/Competitorn/a
Meas. Tech.ChEMBL_205626 (CHEMBL812385)
Ki 11±n/a nM
Citation Gowravaram, MRTomczuk, BEJohnson, JSDelecki, DCook, ERGhose, AKMathiowetz, AMSpurlino, JCRubin, BSmith, DL Inhibition of matrix metalloproteinases by hydroxamates containing heteroatom-based modifications of the P1' group. J Med Chem38:2570-81 (1995) Stromelysin-1
Name:Stromelysin-1
Type:Enzyme
Mol. Mass.:53973.13
Organism:Homo sapiens (Human)
Description: P08254
Residue:477
BDBM50031789
NameBDBM50031789
Synonyms:(R)-N*1*-((S)-2,2-Dimethyl-1-methylcarbamoyl-propyl)-N*4*-hydroxy-2-[4-(4-propyl-phenoxy)-butyl]-succinamide | CHEMBL87460
TypeSmall organic molecule
Emp. Form.C24H39N3O5
Mol. Mass.449.5836
SMILESCCCc1ccc(OCCCC[C@H](CC(=O)NO)C(=O)N[C@H](C(=O)NC)C(C)(C)C)cc1