Reaction Details
TargetInterstitial collagenase
LigandBDBM50031798
Substrate/Competitorn/a
Meas. Tech.ChEMBL_49513 (CHEMBL663463)
Ki 3±n/a nM
Citation Gowravaram, MRTomczuk, BEJohnson, JSDelecki, DCook, ERGhose, AKMathiowetz, AMSpurlino, JCRubin, BSmith, DL Inhibition of matrix metalloproteinases by hydroxamates containing heteroatom-based modifications of the P1' group. J Med Chem38:2570-81 (1995) Interstitial collagenase
Name:Interstitial collagenase
Type:Enzyme
Mol. Mass.:54010.26
Organism:Homo sapiens (Human)
Description: P03956
Residue:469
BDBM50031798
NameBDBM50031798
Synonyms:(R)-N*1*-((S)-2,2-Dimethyl-1-methylcarbamoyl-propyl)-N*4*-hydroxy-2-(4-phenoxy-butyl)-succinamide | CHEMBL315493
TypeSmall organic molecule
Emp. Form.C21H33N3O5
Mol. Mass.407.5038
SMILESCNC(=O)[C@@H](NC(=O)[C@H](CCCCOc1ccccc1)CC(=O)NO)C(C)(C)C