Reaction Details
TargetType-1 angiotensin II receptor
LigandBDBM50031953
Substrate/Competitorn/a
Meas. Tech.ChEMBL_36797 (CHEMBL650317)
Ki 0.48±n/a nM
Citation Kiyama, RHonma, THayashi, KOgawa, MHara, MFujimoto, MFujishita, T Novel angiotensin II receptor antagonists. Design, synthesis, and in vitro evaluation of dibenzo[a,d]cycloheptene and dibenzo[b,f]oxepin derivatives. Searching for bioisosteres of biphenylyltetrazole using a three-dimensional search technique. J Med Chem38:2728-41 (1995) Type-1 angiotensin II receptor
Name:Type-1 angiotensin II receptor
Type:Protein
Mol. Mass.:41080.75
Organism:Homo sapiens (Human)
Description:P30556
Residue:359
BDBM50031953
NameBDBM50031953
Synonyms:3-(2-Ethyl-6-methoxy-[1,5]naphthyridin-4-yloxymethyl)-11-(1H-tetrazol-5-yl)-dibenzo[a,d]cyclohepten-5-one | CHEMBL96552
TypeSmall organic molecule
Emp. Form.C28H22N6O3
Mol. Mass.490.5127
SMILESCCc1cc(OCc2ccc3c(cc4ccccc4c(=O)c3c2)-c2nnn[nH]2)c2nc(OC)ccc2n1