Reaction Details
TargetType-1 angiotensin II receptor
LigandBDBM50031958
Substrate/Competitorn/a
Meas. Tech.ChEMBL_36797 (CHEMBL650317)
Ki 9.6±n/a nM
Citation Kiyama, RHonma, THayashi, KOgawa, MHara, MFujimoto, MFujishita, T Novel angiotensin II receptor antagonists. Design, synthesis, and in vitro evaluation of dibenzo[a,d]cycloheptene and dibenzo[b,f]oxepin derivatives. Searching for bioisosteres of biphenylyltetrazole using a three-dimensional search technique. J Med Chem38:2728-41 (1995) Type-1 angiotensin II receptor
Name:Type-1 angiotensin II receptor
Type:Protein
Mol. Mass.:41080.75
Organism:Homo sapiens (Human)
Description:P30556
Residue:359
BDBM50031958
NameBDBM50031958
Synonyms:(S)-3-Methyl-2-{pentanoyl-[11-(1H-tetrazol-5-yl)-dibenzo[b,f]oxepin-3-ylmethyl]-amino}-butyric acid | CHEMBL328738
TypeSmall organic molecule
Emp. Form.C26H29N5O4
Mol. Mass.475.5396
SMILESCCCCC(=O)N(Cc1ccc2c(Oc3ccccc3C=C2c2nnn[nH]2)c1)[C@@H](C(C)C)C(O)=O