Reaction Details
TargetType-1 angiotensin II receptor
LigandBDBM50031962
Substrate/Competitorn/a
Meas. Tech.ChEMBL_36797 (CHEMBL650317)
Ki 0.29±n/a nM
Citation Kiyama, RHonma, THayashi, KOgawa, MHara, MFujimoto, MFujishita, T Novel angiotensin II receptor antagonists. Design, synthesis, and in vitro evaluation of dibenzo[a,d]cycloheptene and dibenzo[b,f]oxepin derivatives. Searching for bioisosteres of biphenylyltetrazole using a three-dimensional search technique. J Med Chem38:2728-41 (1995) Type-1 angiotensin II receptor
Name:Type-1 angiotensin II receptor
Type:Protein
Mol. Mass.:41080.75
Organism:Homo sapiens (Human)
Description:P30556
Residue:359
BDBM50031962
NameBDBM50031962
Synonyms:3-(5,7-Dimethyl-2-propyl-imidazo[4,5-b]pyridin-3-ylmethyl)-11-(1H-tetrazol-5-yl)-dibenzo[a,d]cyclohepten-5-one | CHEMBL92950
TypeSmall organic molecule
Emp. Form.C28H25N7O
Mol. Mass.475.5444
SMILESCCCc1nc2c(C)cc(C)nc2n1Cc1ccc2c(cc3ccccc3c(=O)c2c1)-c1nnn[nH]1