Reaction Details
TargetRetinoic acid receptor RXR-alpha
LigandBDBM50032665
Substrate/Competitorn/a
Meas. Tech.ChEMBL_196764 (CHEMBL797916)
Kd 1159±n/a nM
Citation Boehm, MFZhang, LZhi, LMcClurg, MRBerger, EWagoner, MMais, DESuto, CMDavies, JAHeyman, RA Design and synthesis of potent retinoid X receptor selective ligands that induce apoptosis in leukemia cells. J Med Chem38:3146-55 (1995) Retinoic acid receptor RXR-alpha
Name:Retinoic acid receptor RXR-alpha
Type:PROTEIN
Mol. Mass.:50820.38
Organism:Homo sapiens (Human)
Description:ChEMBL_1456363
Residue:462
BDBM50032665
NameBDBM50032665
Synonyms:4-[1-(3,5,5-Trimethyl-5,6,7,8-tetrahydro-naphthalen-2-yl)-vinyl]-benzoic acid | CHEMBL108402
TypeSmall organic molecule
Emp. Form.C22H24O2
Mol. Mass.320.4248
SMILESCc1cc2c(CCCC2(C)C)cc1C(=C)c1ccc(cc1)C(O)=O