Reaction Details
TargetRetinoic acid receptor RXR-alpha
LigandBDBM50032663
Substrate/Competitorn/a
Meas. Tech.ChEMBL_196764 (CHEMBL797916)
Kd>1000±n/a nM
Citation Boehm, MFZhang, LZhi, LMcClurg, MRBerger, EWagoner, MMais, DESuto, CMDavies, JAHeyman, RA Design and synthesis of potent retinoid X receptor selective ligands that induce apoptosis in leukemia cells. J Med Chem38:3146-55 (1995) Retinoic acid receptor RXR-alpha
Name:Retinoic acid receptor RXR-alpha
Type:PROTEIN
Mol. Mass.:50820.38
Organism:Homo sapiens (Human)
Description:ChEMBL_1456363
Residue:462
BDBM50032663
NameBDBM50032663
Synonyms:4-(3,5,5,8,8-Pentamethyl-5,6,7,8-tetrahydro-naphthalen-2-ylmethyl)-benzoic acid | CHEMBL432587
TypeSmall organic molecule
Emp. Form.C23H28O2
Mol. Mass.336.4672
SMILESCc1cc2c(cc1Cc1ccc(cc1)C(O)=O)C(C)(C)CCC2(C)C