Reaction Details
TargetRetinoic acid receptor RXR-beta
LigandBDBM50032676
Substrate/Competitorn/a
Meas. Tech.ChEMBL_197067 (CHEMBL806656)
Kd 770±n/a nM
Citation Boehm, MFZhang, LZhi, LMcClurg, MRBerger, EWagoner, MMais, DESuto, CMDavies, JAHeyman, RA Design and synthesis of potent retinoid X receptor selective ligands that induce apoptosis in leukemia cells. J Med Chem38:3146-55 (1995) Retinoic acid receptor RXR-beta
Name:Retinoic acid receptor RXR-beta
Type:PROTEIN
Mol. Mass.:55877.78
Organism:Mus musculus
Description:ChEMBL_196588
Residue:520
BDBM50032676
NameBDBM50032676
Synonyms:4-(3,5,5,8,8-Pentamethyl-5,6,7,8-tetrahydro-naphthalen-2-yloxy)-benzoic acid | CHEMBL105805
TypeSmall organic molecule
Emp. Form.C22H26O3
Mol. Mass.338.44
SMILESCc1cc2c(cc1Oc1ccc(cc1)C(O)=O)C(C)(C)CCC2(C)C