Reaction Details
TargetRetinoic acid receptor RXR-gamma
LigandBDBM50032662
Substrate/Competitorn/a
Meas. Tech.ChEMBL_197226 (CHEMBL798202)
Kd 283±n/a nM
Citation Boehm, MFZhang, LZhi, LMcClurg, MRBerger, EWagoner, MMais, DESuto, CMDavies, JAHeyman, RA Design and synthesis of potent retinoid X receptor selective ligands that induce apoptosis in leukemia cells. J Med Chem38:3146-55 (1995) Retinoic acid receptor RXR-gamma
Name:Retinoic acid receptor RXR-gamma
Type:PROTEIN
Mol. Mass.:50900.28
Organism:Mus musculus
Description:ChEMBL_196589
Residue:463
BDBM50032662
NameBDBM50032662
Synonyms:4-[1-(1,1,2,3,3,6-Hexamethyl-indan-5-yl)-vinyl]-benzoic acid | CHEMBL106837
TypeSmall organic molecule
Emp. Form.C24H28O2
Mol. Mass.348.4779
SMILESCC1C(C)(C)c2cc(C)c(cc2C1(C)C)C(=C)c1ccc(cc1)C(O)=O