Reaction Details
TargetRetinoic acid receptor RXR-beta
LigandBDBM50032673
Substrate/Competitorn/a
Meas. Tech.ChEMBL_197061 (CHEMBL807508)
EC50>10000±n/a nM
Citation Boehm, MFZhang, LZhi, LMcClurg, MRBerger, EWagoner, MMais, DESuto, CMDavies, JAHeyman, RA Design and synthesis of potent retinoid X receptor selective ligands that induce apoptosis in leukemia cells. J Med Chem38:3146-55 (1995) Retinoic acid receptor RXR-beta
Name:Retinoic acid receptor RXR-beta
Type:PROTEIN
Mol. Mass.:55877.78
Organism:Mus musculus
Description:ChEMBL_196588
Residue:520
BDBM50032673
NameBDBM50032673
Synonyms:2-(3,5,5,8,8-Pentamethyl-5,6,7,8-tetrahydro-naphthalene-2-carbonyl)-benzoic acid | CHEMBL105806
TypeSmall organic molecule
Emp. Form.C23H26O3
Mol. Mass.350.4507
SMILESCc1cc2c(cc1C(=O)c1ccccc1C(O)=O)C(C)(C)CCC2(C)C