Reaction Details
TargetRetinoic acid receptor RXR-beta
LigandBDBM50032666
Substrate/Competitorn/a
Meas. Tech.ChEMBL_197061 (CHEMBL807508)
EC50 9±n/a nM
Citation Boehm, MFZhang, LZhi, LMcClurg, MRBerger, EWagoner, MMais, DESuto, CMDavies, JAHeyman, RA Design and synthesis of potent retinoid X receptor selective ligands that induce apoptosis in leukemia cells. J Med Chem38:3146-55 (1995) Retinoic acid receptor RXR-beta
Name:Retinoic acid receptor RXR-beta
Type:PROTEIN
Mol. Mass.:55877.78
Organism:Mus musculus
Description:ChEMBL_196588
Residue:520
BDBM50032666
NameBDBM50032666
Synonyms:6-[1-(3,5,5,8,8-Pentamethyl-5,6,7,8-tetrahydro-naphthalen-2-yl)-vinyl]-nicotinic acid | CHEMBL109117
TypeSmall organic molecule
Emp. Form.C23H27NO2
Mol. Mass.349.466
SMILESCc1cc2c(cc1C(=C)c1ccc(cn1)C(O)=O)C(C)(C)CCC2(C)C