Reaction Details
TargetRetinoic acid receptor RXR-alpha
LigandBDBM50033065
Substrate/Competitorn/a
Meas. Tech.ChEMBL_196906 (CHEMBL807368)
EC50 380±n/a nM
Citation Dawson, MIJong, LHobbs, PDCameron, JFChao, WRPfahl, MLee, MOShroot, BPfahl, M Conformational effects on retinoid receptor selectivity. 2. Effects of retinoid bridging group on retinoid X receptor activity and selectivity. J Med Chem38:3368-83 (1995) Retinoic acid receptor RXR-alpha
Name:Retinoic acid receptor RXR-alpha
Type:PROTEIN
Mol. Mass.:50820.38
Organism:Homo sapiens (Human)
Description:ChEMBL_1456363
Residue:462
BDBM50033065
NameBDBM50033065
Synonyms:(2E,4E)-3,7-Dimethyl-6-(5,5,8,8-tetramethyl-5,6,7,8-tetrahydro-naphthalen-2-yl)-octa-2,4,6-trienoic acid | CHEMBL414233
TypeSmall organic molecule
Emp. Form.C24H32O2
Mol. Mass.352.5097
SMILES[#6]\[#6](-[#6])=[#6](\[#6]=[#6]\[#6](\[#6])=[#6]\[#6](-[#8])=O)/c1ccc2c(c1)C([#6])([#6])[#6]-[#6]C2([#6])[#6]