Reaction Details
TargetCarnitine O-palmitoyltransferase 1, liver isoform
LigandBDBM50033117
Substrate/Competitorn/a
Meas. Tech.ChEMBL_46332 (CHEMBL662623)
Ki 3600±n/a nM
Citation Anderson, RCBalestra, MBell, PADeems, ROFillers, WSFoley, JEFraser, JDMann, WRRudin, MVillhauer, EB Antidiabetic agents: a new class of reversible carnitine palmitoyltransferase I inhibitors. J Med Chem38:3448-50 (1995) Carnitine O-palmitoyltransferase 1, liver isoform
Name:Carnitine O-palmitoyltransferase 1, liver isoform
Type:PROTEIN
Mol. Mass.:88147.11
Organism:Rattus norvegicus
Description:ChEMBL_887445
Residue:773
BDBM50033117
NameBDBM50033117
Synonyms:CHEMBL114113 | [3-Carboxy-2-(hydroxy-tetradecyloxy-phosphoryloxy)-propyl]-trimethyl-ammonium
TypeSmall organic molecule
Emp. Form.C21H44NO6P
Mol. Mass.437.5509
([O-])(=O)O[C@H](CC(O)=O)C[N+](C)(C)C