Reaction Details
TargetPhosphatidylinositol 4,5-bisphosphate 3-kinase catalytic subunit alpha isoform
LigandBDBM50502317
Substrate/Competitorn/a
Meas. Tech.ChEMBL_1806418 (CHEMBL4305777)
IC50 1.000000±n/a nM
Citation Hei, YYZhang, SQFeng, YWang, JDuan, WZhang, HMao, SSun, HXin, M Alkylsulfonamide-containing quinazoline derivatives as potent and orally bioavailable PI3Ks inhibitors. Bioorg Med Chem27:0 (2019) 
 
Phosphatidylinositol 4,5-bisphosphate 3-kinase catalytic subunit alpha isoform
Name:Phosphatidylinositol 4,5-bisphosphate 3-kinase catalytic subunit alpha isoform
Type:Enzyme Subunit
Mol. Mass.:124294.87
Organism:Homo sapiens (Human)
Description:P42336
Residue:1068
BDBM50502317
NameBDBM50502317
Synonyms:CHEMBL4471468
TypeSmall organic molecule
Emp. Form.C23H26N6O4S
Mol. Mass.482.555
SMILESCOc1ncc(cc1NS(C)(=O)=O)-c1ccc2ncnc(N[C@H]3CCN(C3)C(=O)C3CC3)c2c1