Reaction Details
TargetBeta-lactamase
LigandBDBM50033687
Substrate/Competitorn/a
Meas. Tech.ChEMBL_40539 (CHEMBL876084)
IC50>20000±n/a nM
Citation Buynak, JDWu, KBachmann, BKhasnis, DHua, LNguyen, HKCarver, CL Synthesis and biological activity of 7-alkylidenecephems. J Med Chem38:1022-34 (1995) Beta-lactamase
Name:Beta-lactamase
Type:PROTEIN
Mol. Mass.:41306.67
Organism:Enterobacter cloacae
Description:ChEMBL_40258
Residue:381
BDBM50033687
NameBDBM50033687
Synonyms:CHEMBL8259 | Sodium; (R)-3-acetoxymethyl-7-dichloromethylene-8-oxo-5-thia-1-aza-bicyclo[4.2.0]oct-2-ene-2-carboxylate
TypeSmall organic molecule
Emp. Form.C11H8Cl2NO5S
Mol. Mass.337.156
SMILES[#6]-[#6](=O)-[#8]-[#6]-[#6]-1=[#6](-[#7]-2-[#6@H](-[#16]-[#6]-1)\[#6](=[#6](\Cl)Cl)-[#6]-2=O)-[#6](-[#8-])=O