Reaction Details
TargetBeta-lactamase TEM
LigandBDBM50033697
Substrate/Competitorn/a
Meas. Tech.ChEMBL_40710 (CHEMBL653595)
IC50>20000±n/a nM
Citation Buynak, JDWu, KBachmann, BKhasnis, DHua, LNguyen, HKCarver, CL Synthesis and biological activity of 7-alkylidenecephems. J Med Chem38:1022-34 (1995) Beta-lactamase TEM
Name:Beta-lactamase TEM
Type:Enzyme
Mol. Mass.:31512.33
Organism:Escherichia coli
Description:P62593
Residue:286
BDBM50033697
NameBDBM50033697
Synonyms:CHEMBL8571 | Sodium; (R)-3-acetoxymethyl-8-oxo-7-[2-oxo-prop-(Z)-ylidene]-5-thia-1-aza-bicyclo[4.2.0]oct-2-ene-2-carboxylate
TypeSmall organic molecule
Emp. Form.C13H12NO6S
Mol. Mass.310.303
SMILESCC(=O)OCC1=C(N2[C@H](SC1)C(=CC(C)=O)C2=O)C([O-])=O