Reaction Details
TargetBeta-lactamase TEM
LigandBDBM50033698
Substrate/Competitorn/a
Meas. Tech.ChEMBL_40713 (CHEMBL653598)
IC50>20000±n/a nM
Citation Buynak, JDWu, KBachmann, BKhasnis, DHua, LNguyen, HKCarver, CL Synthesis and biological activity of 7-alkylidenecephems. J Med Chem38:1022-34 (1995) Beta-lactamase TEM
Name:Beta-lactamase TEM
Type:Enzyme
Mol. Mass.:31512.33
Organism:Escherichia coli
Description:P62593
Residue:286
BDBM50033698
NameBDBM50033698
Synonyms:CHEMBL273744 | Sodium; (R)-3-acetoxymethyl-7-[2-hydroxy-eth-(Z)-ylidene]-5,5,8-trioxo-5lambda*6*-thia-1-aza-bicyclo[4.2.0]oct-2-ene-2-carboxylate
TypeSmall organic molecule
Emp. Form.C12H12NO8S
Mol. Mass.330.291
SMILESCC(=O)OCC1=C(N2[C@@H](\C(=C/CO)C2=O)S(=O)(=O)C1)C([O-])=O