Reaction Details
TargetBeta-lactamase
LigandBDBM50033684
Substrate/Competitorn/a
Meas. Tech.ChEMBL_40544 (CHEMBL652174)
IC50>20000±n/a nM
Citation Buynak, JDWu, KBachmann, BKhasnis, DHua, LNguyen, HKCarver, CL Synthesis and biological activity of 7-alkylidenecephems. J Med Chem38:1022-34 (1995) Beta-lactamase
Name:Beta-lactamase
Type:PROTEIN
Mol. Mass.:41306.67
Organism:Enterobacter cloacae
Description:ChEMBL_40258
Residue:381
BDBM50033684
NameBDBM50033684
Synonyms:CHEMBL269657 | Sodium; (R)-3-acetoxymethyl-7-[1-bromo-meth-(E)-ylidene]-5,5,8-trioxo-5lambda*6*-thia-1-aza-bicyclo[4.2.0]oct-2-ene-2-carboxylate
TypeSmall organic molecule
Emp. Form.C11H9BrNO7S
Mol. Mass.379.161
SMILESCC(=O)OCC1=C(N2[C@@H](\C(=C\Br)C2=O)S(=O)(=O)C1)C([O-])=O