Reaction Details
TargetBeta-lactamase
LigandBDBM50033681
Substrate/Competitorn/a
Meas. Tech.ChEMBL_40540 (CHEMBL652170)
IC50>20000±n/a nM
Citation Buynak, JDWu, KBachmann, BKhasnis, DHua, LNguyen, HKCarver, CL Synthesis and biological activity of 7-alkylidenecephems. J Med Chem38:1022-34 (1995) Beta-lactamase
Name:Beta-lactamase
Type:PROTEIN
Mol. Mass.:41306.67
Organism:Enterobacter cloacae
Description:ChEMBL_40258
Residue:381
BDBM50033681
NameBDBM50033681
Synonyms:CHEMBL268631 | Sodium; (R)-3-acetoxymethyl-8-oxo-7-[1-phenyl-meth-(Z)-ylidene]-5-thia-1-aza-bicyclo[4.2.0]oct-2-ene-2-carboxylate
TypeSmall organic molecule
Emp. Form.C17H14NO5S
Mol. Mass.344.362
SMILESCC(=O)OCC1=C(N2[C@H](SC1)\C(=C/c1ccccc1)C2=O)C([O-])=O